{"text_format":"1","workbook":"xlsx","n_sheets":7,"sheets":["Calculator","Log","Fe dosing","CarbonVS3","Volume Calc","PPM>ml","S-calc"],"not_rendered":{"charts":6,"images":0,"macros":1,"external_links":0,"defined_names":1,"comments":2,"pivot_tables":0},"unopened":[],"bounds":{"document_bytes":16777216,"sheet_cells":100000,"rows_first":2000,"rows_last":500,"rows_between":2000,"halvings":0,"cell_chars":16384,"cell_head_chars":4096},"cells_cut":0,"cells_raw":0,"read":"whole","date_system":"1900"}

{"sheet":"Calculator","index":0,"n_rows":30,"n_cols":13,"rows_kept":30,"cut":false,"hidden":false,"merged":[[1,5,1,7],[5,3,5,7],[22,6,22,8],[22,1,23,5],[23,6,23,8],[3,3,3,4],[3,5,3,7],[4,3,4,4],[4,5,4,7],[5,9,5,10],[17,1,17,2],[18,9,18,10],[18,1,18,2],[21,1,21,2],[6,11,9,11],[14,1,14,2],[6,9,7,9],[6,10,7,10],[16,1,16,2]]}
[null,null,null,null,null,"English","Deutsch"]
[null,null,null,null,null,{"$f":"IF($I$2=\"Deutsch\",\"Sprache\",\"Choosen Language\")","v":"Sprache"},null,null,"Deutsch"]
[]
[null,{"$f":"IF($I$2=\"Deutsch\",\"***  Dutch Synthetic Reefing  ***  ( die DSR Method )  ***\",\"***  Dutch Synthetic Reefing  ***  ( The DSR Method )  ***\")","v":"***  Dutch Synthetic Reefing  ***  ( die DSR Method )  ***"},null,{"$f":"IF($I$2=\"Deutsch\",\"Name:\",\"Name user :\")","v":"Name:"},null,"Test Aquarium",null,null,"vers.170603DEU"]
[null,{"$f":"IF($I$2=\"Deutsch\",\"DSR Mineralien Rechner durch GlennF\",\"DSR Minerals Calculator by GlennF\")","v":"DSR Mineralien Rechner durch GlennF"},null,{"$f":"IF($I$2=\"Deutsch\",\"Welche Handlung ? \",\"What action ? \")","v":"Welche Handlung ? "},null,"Korrektur",null,null,{"$f":"IF($I$2=\"Deutsch\",\"Zuletzt Bearbeiten\",\"Last saved date\")","v":"Zuletzt Bearbeiten"}]
[null,{"$f":"IF($I$2=\"Deutsch\",\" Berechnungen für die Wassermenge (in Litern)\",\"Water volume for Calculations ( in liters )\")","v":" Berechnungen für die Wassermenge (in Litern)"},100,null,null,null,null,null,{"$f":"TODAY()","v":"2017-06-03"},{"$f":"IF($I$2=\"Deutsch\",\"Maximale Tag Korrekturen\",\"Maximum day corrections\")","v":"Maximale Tag Korrekturen"},null,{"$f":"IF($I$2=\"Deutsch\",\"Auto doseer oplossingen\",\"Auto dosing Solutions\")","v":"Auto doseer oplossingen"}]
[null,{"$f":"IF($I$2=\"Deutsch\",\"Gemessen / Erreichen / max. erhöhen/Tag / Test / intervall\",\"Measurement / Range / max.TopUp/day  / Used test / Test interval\")","v":"Gemessen / Erreichen / max. erhöhen/Tag / Test / intervall"},null,{"$f":"IF($I$2=\"Deutsch\",\"gemessene werte\",\"Measured value\")","v":"gemessene werte"},{"$f":"IF($I$2=\"Deutsch\",\"Optimale werte\",\"Target  value\")","v":"Optimale werte"},{"$f":"IF($I$2=\"Deutsch\",\"Korrektur\",\"Correction\")","v":"Korrektur"},{"$f":"IF($I$2=\"Deutsch\",\"neues wasser\",\"New water\")","v":"neues wasser"},null,{"$f":"IF($I$2=\"Deutsch\",\"Einheit / Mittel\",\"Units /  Product\")","v":"Einheit / Mittel"},{"$f":"IF($I$2=\"Deutsch\",\"Dosierung Tage\",\"Total days to dose\")","v":"Dosierung Tage"},{"$f":"IF($I$2=\"Deutsch\",\"Tag Dosierung \",\"Single day dosing \")","v":"Tag Dosierung "},{"$f":"IF($I$2=\"Deutsch\",\" (Extra) Verbrauch in dieser Zeit (ml)\",\"(additional) consumption this period (ml)\")","v":" (Extra) Verbrauch in dieser Zeit (ml)"},"Default target"]
[null,{"$f":"IF($I$2=\"Deutsch\",\"Osmose Wasserbedarf in neue Produktions\",\"RO water required when mixing new water\")","v":"Osmose Wasserbedarf in neue Produktions"},null,null,null,{"$f":"IF(AND(OR($F$5=\"Correction\",$F$5=\"Korrektur\"),$D$9=\"x\"),\"No Data\",IF(OR($F$5=\"Korrektur\",$F$5=\"Correction\"),\"\",\"\"))","v":""},{"$f":"IF(OR($F$5=\"Correction\",$F$5=\"Korrektur\"),\"\",($C$6)*(1-0.0166))","v":""},null,{"$f":"IF($I$2=\"Deutsch\",\"Liters / Osmose water\",\"Liters / RO Water\")","v":"Liters / Osmose water"}]
[null,{"$f":"IF($I$2=\"Deutsch\",\"PH: (Target 7,95-8,2)  empfohlen wird ein elektronisches Messgerät verwenden.\",\"PH: (Target 7,95-8,2) preferably 24/7 electronic measurement \")","v":"PH: (Target 7,95-8,2)  empfohlen wird ein elektronisches Messgerät verwenden."},"00:00:00",7.9,8.3000000000000007,{"$f":"IF(AND(OR($F$5=\"Correction\",$F$5=\"Korrektur\"),$D$9=\"x\"),\"No Data\",IF(OR($F$5=\"Korrektur\",$F$5=\"Correction\"),\"\",\"\"))","v":""},{"$f":"IF(OR($F$5=\"Correction\",$F$5=\"Korrektur\"),\"\",\"---------\")","v":""},null,{"$f":"IF(AND(OR($F$5=\"Correction\",$F$5=\"Korrektur\"),$D$9=\"x\"),\"No Data\",IF(AND(OR($F$5=\"Correction\",$F$5=\"Korrektur\"),$D$9>7.95),\" \",\"Mit PH + (anstelle von KH +)\"))","v":"Mit PH + (anstelle von KH +)"},"-","auto",null,8.3000000000000007]
[null,{"$f":"IF($I$2=\"Deutsch\",\"Salinität: (Target 33-34ppt) – (max. 2ppt/Tag) - Refraktometer - 1 monate.\",\"Salinity: (Target 33-34ppt) – (max. 2ppt/day) – Refractometer - 4wks\")","v":"Salinität: (Target 33-34ppt) – (max. 2ppt/Tag) - Refraktometer - 1 monate."},null,33,33,{"$f":"IF(AND(OR($F$5=\"Correction\",$F$5=\"Korrektur\"),$D$10=\"x\"),\"No Data\",IF(OR($F$5=\"Correction\",$F$5=\"Korrektur\"),($C$6/100)*($E10-$D10)*100,\"\"))","v":0},{"$f":"IF(OR($F$5=\"Correction\",$F$5=\"Korrektur\"),\"\",($C$6/100)*($E10-0)*100*(27.2656/35))","v":""},null,{"$f":"IF($I$2=\"Deutsch\",\"g / NaCl+ . reines Salz\",\"g / NaCl+ . pure Salt\")","v":"g / NaCl+ . reines Salz"},{"$f":"ROUNDUP((E10-D10)/2,0)","v":0},{"$f":"IF(F10=\"\",0,F10/J10)","v":{"$error":"#DIV/0!"}},null,33]
[null,{"$f":"IF($I$2=\"Deutsch\",\"KH: (Target 7-9) – (max. 1dKH/Tag) - Salifert KH - wöchentlich!\",\"KH: (Target 7-9) – (max. 1dKH/day) - Salifert KH - weekly!\")","v":"KH: (Target 7-9) – (max. 1dKH/Tag) - Salifert KH - wöchentlich!"},null,7,8,{"$f":"IF(AND(OR($F$5=\"Correction\",$F$5=\"Korrektur\"),$D$11=\"x\"),\"No Data\",IF(OR($F$5=\"Correction\",$F$5=\"Korrektur\"),($C$6/100)*($E11-$D11)*3,\"\"))","v":3},{"$f":"IF(OR($F$5=\"Correction\",$F$5=\"Korrektur\"),\"\",($C$6/100)*($E11-0)*3)","v":""},null,{"$f":"IF($I$2=\"Deutsch\",\"g / KH+ .Natriumbicarbonat\",\"g / KH+ . SodiumBicarbonate*\")","v":"g / KH+ .Natriumbicarbonat"},{"$f":"ROUNDUP((E11-D11)/1,0)","v":1},{"$f":"IF(F11=\"\",0,F11/J11)","v":3},{"$f":"IF(AND(OR($F$5=\"Correction\",$F$5=\"Korrektur\"),$D$11=\"x\"),\"No Data\",IF(OR($F$5=\"Correction\",$F$5=\"Korrektur\"),($C$6/100)*($E11-$D11)*3*11.1,\"\"))","v":33.299999999999997},8]
[null,{"$f":"IF($I$2=\"Deutsch\",\"Ca: (Target 420-460) – (max. 20ppm/Tag) - Salifert Ca - wöchentlich!\",\"Ca: (Target 420-460) – (max. 20ppm/day) - Salifert Ca - weekly!\")","v":"Ca: (Target 420-460) – (max. 20ppm/Tag) - Salifert Ca - wöchentlich!"},null,335,440,{"$f":"IF(AND(OR($F$5=\"Correction\",$F$5=\"Korrektur\"),$D$12=\"x\"),\"No Data\",IF(OR($F$5=\"Correction\",$F$5=\"Korrektur\"),($C$6/100)*($E12-$D12)*0.3668,\"\"))","v":38.514000000000003},{"$f":"IF(OR($F$5=\"Correction\",$F$5=\"Korrektur\"),\"\",($C$6/100)*($E12-0)*0.3668)","v":""},null,{"$f":"IF($I$2=\"Deutsch\",\"g / Ca+ . Calciumchlorid\",\"g / Ca+ . CalciumChloride\")","v":"g / Ca+ . Calciumchlorid"},{"$f":"ROUNDUP((E12-D12)/20,0)","v":6},{"$f":"IF(F12=\"\",0,F12/J12)","v":6.4190000000000005},{"$f":"IF(AND(OR($F$5=\"Correction\",$F$5=\"Korrektur\"),$D$12=\"x\"),\"No Data\",IF(OR($F$5=\"Correction\",$F$5=\"Korrektur\"),($C$6/100)*($E12-$D12)*0.3668*1.429,\"\"))","v":55.036506000000003},440]
[null,{"$f":"IF($I$2=\"Deutsch\",\"Mg: (Target 1300-1400) – (max. 50ppm/Tag) - Salifert Mg - 1 monate\",\"Mg: (Target 1300-1400) – (max. 50ppm/day) - Salifert Mg - 4wks\")","v":"Mg: (Target 1300-1400) – (max. 50ppm/Tag) - Salifert Mg - 1 monate"},null,1305,1350,{"$f":"IF(AND(OR($F$5=\"Correction\",$F$5=\"Korrektur\"),$D$13=\"x\"),\"No Data\",IF(OR($F$5=\"Correction\",$F$5=\"Korrektur\"),($C$6/100)*($E13-$D13)*0.836,\"\"))","v":37.619999999999997},{"$f":"IF(OR($F$5=\"Correction\",$F$5=\"Korrektur\"),\"\",(($C$6/1000)*($E13-($G$14/$C$6)*1000*(24.31/246.482))*(203.306/24.31)))","v":""},null,{"$f":"IF($I$2=\"Deutsch\",\"g / Mg+ .MagnesiumChlorid\",\"g / Mg+ . MagnesiumChloride\")","v":"g / Mg+ .MagnesiumChlorid"},{"$f":"ROUNDUP((E13-D13)/50,0)","v":1},{"$f":"IF(F13=\"\",0,F13/J13)","v":37.619999999999997},{"$f":"IF(AND(OR($F$5=\"Correction\",$F$5=\"Korrektur\"),$D$13=\"x\"),\"No Data\",IF(OR($F$5=\"Correction\",$F$5=\"Korrektur\"),($C$6/100)*($E13-$D13)*0.836*1.33,\"\"))","v":50.034599999999998},1350]
[null,{"$f":"IF($I$2=\"Deutsch\",\"Mg+Sulfat: (nur für neue Produktion)\",\"Mg+Sulfate: (only to be used when mixing new water)\")","v":"Mg+Sulfat: (nur für neue Produktion)"},null,"x",904,{"$f":"IF(AND(OR($F$5=\"Correction\",$F$5=\"Korrektur\"),$D$13=\"x\"),\"No Data\",IF(OR($F$5=\"Correction\",$F$5=\"Korrektur\"),($C$6/100)*($E13-$D13)*0.836*0,\"\"))","v":0},{"$f":"IF(OR($F$5=\"Correction\",$F$5=\"Korrektur\"),\"\",($C$6/1000)*($E14-0)*(246.482/32.06))","v":""},null,{"$f":"IF($I$2=\"Deutsch\",\"g / ....... Magnesiumsulfat\",\"g / ....... MagnesiumSulphate\")","v":"g / ....... Magnesiumsulfat"},null," ",null,904]
[null,{"$f":"IF($I$2=\"Deutsch\",\"Kalium: (Target 380-420) – (20ppm/Tag) - RedSea Potass. - 2  monate\",\"Potassium: (Target 380-420) – (20ppm/d) - RedSea Potass. - 8wks\")","v":"Kalium: (Target 380-420) – (20ppm/Tag) - RedSea Potass. - 2  monate"},null,380,390,{"$f":"IF(AND(OR($F$5=\"Correction\",$F$5=\"Korrektur\"),$D$15=\"x\"),\"No Data\",IF(OR($F$5=\"Correction\",$F$5=\"Korrektur\"),($C$6/100)*($E15-$D15)*0.667,\"\"))","v":6.67},{"$f":"IF(OR($F$5=\"Correction\",$F$5=\"Korrektur\"),\"\",($C$6/100)*($E15-0)*0.667*1)","v":""},null,{"$f":"IF($I$2=\"Deutsch\",\"ml / K+... Kalium (Flüssigkeit)\",\"ml / K+... PotassiumChloride\")","v":"ml / K+... Kalium (Flüssigkeit)"},{"$f":"ROUNDUP((E15-D15)/20,0)","v":1},{"$f":"IF(F15=\"\",0,F15/J15)","v":6.67},null,390]
[null,{"$f":"IF($I$2=\"Deutsch\",\"Strontium: (Target 3-10) – (3ppm/Tag) - Salifert Sr - (50:1 CaSr= 3 monate)\",\"Strontium: (Target 3-10) – (3ppm/day) - Salifert Sr - (50:1 CaSr=12wks)\")","v":"Strontium: (Target 3-10) – (3ppm/Tag) - Salifert Sr - (50:1 CaSr= 3 monate)"},null,1,8,{"$f":"IF(AND(OR($F$5=\"Correction\",$F$5=\"Korrektur\"),$D$16=\"x\"),\"No Data\",IF(OR($F$5=\"Correction\",$F$5=\"Korrektur\"),($C$6/100)*($E16-$D16)*3.04,\"\"))","v":21.28},{"$f":"IF(OR($F$5=\"Correction\",$F$5=\"Korrektur\"),\"\",($C$6/100)*($E16-0)*3.04)","v":""},null,"ml / Sr+ .... Strontium",{"$f":"ROUNDUP((E16-D16)/3,0)","v":3},{"$f":"IF(F16=\"\",0,F16/J16)","v":7.0933333333333337},null,8]
[null,{"$f":"IF($I$2=\"Deutsch\",\"Bor: (Target 3,5-4,4)  (2ppm/Tag) - Salifert Borium - 3 monate\",\"Boron: (Target 3,5-4,4)  (2ppm/day) - Salifert Borium - 12wks\")","v":"Bor: (Target 3,5-4,4)  (2ppm/Tag) - Salifert Borium - 3 monate"},null,1,4,{"$f":"IF(AND(OR($F$5=\"Correction\",$F$5=\"Korrektur\"),$D$17=\"x\"),\"No Data\",IF(OR($F$5=\"Correction\",$F$5=\"Korrektur\"),($C$6/100)*($E17-$D17)*12.68,\"\"))","v":38.04},{"$f":"IF(OR($F$5=\"Correction\",$F$5=\"Korrektur\"),\"\",($C$6/100)*($E17-0)*12.68)","v":""},null,{"$f":"IF($I$2=\"Deutsch\",\"ml / B+ ..... Bor\",\"ml / B+ ..... Boron\")","v":"ml / B+ ..... Bor"},{"$f":"ROUNDUP((E17-D17)/2,0)","v":2},{"$f":"IF(F17=\"\",0,F17/J17)","v":19.02},null,4]
[null,{"$f":"IF($I$2=\"Deutsch\",\"Jod: (Target 0,06) – (0,03ppm/Tag)  - Salifert I - (0,006ppm/Tag= 2 monate)\",\"Iodide: (Target 0,06) – (0,03ppm/day)  - Salifert I - (0,006ppm/d=8wks)\")","v":"Jod: (Target 0,06) – (0,03ppm/Tag)  - Salifert I - (0,006ppm/Tag= 2 monate)"},null,0.03,0.06,{"$f":"IF(AND(OR($F$5=\"Correction\",$F$5=\"Korrektur\"),$D$18=\"x\"),\"No Data\",IF(OR($F$5=\"Correction\",$F$5=\"Korrektur\"),($C$6/100)*($E18-$D18)*100*0.26,\"\"))","v":0.78},{"$f":"IF(OR($F$5=\"Correction\",$F$5=\"Korrektur\"),\"\",($C$6/100)*($E18-0)*100*0.26)","v":""},null,{"$f":"IF($I$2=\"Deutsch\",\"ml / I+ ...... Jod\",\"ml / I+ ...... Iodide\")","v":"ml / I+ ...... Jod"},{"$f":"ROUNDUP((E18-D18)/0.03,0)","v":1},{"$f":"IF(F18=\"\",0,F18/J18)","v":0.78},null,0.06]
[null,{"$f":"IF($I$2=\"Deutsch\",\"Mangan (ppb): (Target 0,4ppb) – (dosieren 0,1ppb/Tag) \",\"Manganese (ppb): (Target 0,4ppb) – (dosing 0,1ppb/day) \")","v":"Mangan (ppb): (Target 0,4ppb) – (dosieren 0,1ppb/Tag) "},null,0,0.4,{"$f":"IF(AND(OR($F$5=\"Correction\",$F$5=\"Korrektur\"),$D$19=\"x\"),\"No Data\",IF(OR($F$5=\"Correction\",$F$5=\"Korrektur\"),($C$6/100)*($E19-$D19)*10*0.1,\"\"))","v":0.4},{"$f":"IF(OR($F$5=\"Correction\",$F$5=\"Korrektur\"),\"\",($C$6/100)*($E19-0)*10*0.1)","v":""},null,{"$f":"IF($I$2=\"Deutsch\",\"ml / Mn+ ( ppb ).. Mangan\",\"ml / Mn+  ( ppb ) .. Manganese\")","v":"ml / Mn+ ( ppb ).. Mangan"},null,null,null,0.4]
[null,{"$f":"IF($I$2=\"Deutsch\",\"Phosphat: (Target 0,04-0,08) (0,04ppm/Tag) - RedSea PO4 - wöchentlich!\",\"Phosphate: (Target 0,04-0,08) (0,04ppm/d) -  RedSea PO4 - weekly!\")","v":"Phosphat: (Target 0,04-0,08) (0,04ppm/Tag) - RedSea PO4 - wöchentlich!"},null,0.02,0.04,{"$f":"IF(AND(OR($F$5=\"Correction\",$F$5=\"Korrektur\",$F$5=\"New water\",$F$5=\"neues wasser\"),$D$20=\"x\"),\"No Data\",IF(AND(OR($F$5=\"Correction\",$F$5=\"Korrektur\",$F$5=\"New water\",$F$5=\"neues wasser\"),$D$20>$E$20),($C$6/100)*(0.15)*10*0.4975,($C$6/100)*($E20-$D20)*100*0.1))","v":0.2},{"$f":"IF(OR($F$5=\"Correction\",$F$5=\"Korrektur\"),\"\",($C$6/100)*($E20-0)*100*0.1*0)","v":""},null,{"$f":"IF(AND(OR($F$5=\"New water\",$F$5=\"neues wasser\"),$D$20=\"x\"),\"No Data\",IF(AND(OR($F$5=\"Correction\",$F$5=\"Korrektur\",$F$5=\"New water\",$F$5=\"neues wasser\"),$D$20>$E20),\"ml / Fe+** 0,15ppm maximal\",\"ml / PO4+ .. Phosphate**\"))","v":"ml / PO4+ .. Phosphate**"},1,{"$f":"IF($I$2=\"Deutsch\",\"Tabelle\",\"table\")","v":"Tabelle"},{"$f":"IF(AND(OR($F$5=\"New water\",$F$5=\"neues wasser\"),$D$20=\"x\"),\"\",IF(AND(OR($F$5=\"Correction\",$F$5=\"Korrektur\",$F$5=\"New water\",$F$5=\"neues wasser\"),$D$20<0.11,$D$20>0.01),\"\",\"< Alarm!\"))","v":""},0.04]
[null,{"$f":"IF($I$2=\"Deutsch\",\"Nitrat: (Target 1-3) (2ppm/Tag)  - Salifert NO3 - 3 Wochen\",\"Nitrate: (Target 1-3)  (2ppm/d) - Salifert NO3 - 3wks\")","v":"Nitrat: (Target 1-3) (2ppm/Tag)  - Salifert NO3 - 3 Wochen"},"2xNO3+",1.5,2.5,{"$f":"IF(AND(OR($F$5=\"Correction\",$F$5=\"Korrektur\",$F$5=\"New water\",$F$5=\"neues wasser\"),$D$21=\"x\"),\"No Data\",IF(AND(OR($F$5=\"Correction\",$F$5=\"Korrektur\"),$D$21>$E$21),\"-----\",($C$6/100)*($E21-$D21)*(1.44/2)))","v":0.72},{"$f":"IF(OR($F$5=\"Correction\",$F$5=\"Korrektur\"),\"\",($C$6/100)*($E21-0)*(1.44/2))","v":""},null,{"$f":"IF(AND(OR($F$5=\"Correction\",$F$5=\"Korrektur\"),$D$21=\"x\"),\"No Data\",IF(AND(OR($F$5=\"Correction\",$F$5=\"Korrektur\"),$D$21>$E$21),\". CarbonVS***.\",\"ml / 2xNO3+ . Nitrate NEW!!!\"))","v":"ml / 2xNO3+ . Nitrate NEW!!!"},1,{"$f":"IF($I$2=\"Deutsch\",\"Tabelle\",\"table\")","v":"Tabelle"},{"$f":"IF(AND(OR($F$5=\"New water\",$F$5=\"neues wasser\"),$D$21=\"x\"),\"\",IF(AND(OR($F$5=\"Correction\",$F$5=\"Korrektur\",$F$5=\"New water\",$F$5=\"neues wasser\"),$D$21<6,$D$21>0.4),\"\",\"< Alarm!\"))","v":""},2.5]
[null,{"$f":"IF($I$2=\"Deutsch\",\"Eisen: (max wert/Kein Zielwert)  - Sera Fe - 2 monate\",\"Iron: (Peek value, not target  value) - Sera Fe - 8wks\")","v":"Eisen: (max wert/Kein Zielwert)  - Sera Fe - 2 monate"},null,0,{"$f":"IF($D$20>$E$20,\"0,15\",\"0,02\")","v":"0,02"},{"$f":"IF(AND(OR($F$5=\"Correction\",$F$5=\"Korrektur\"),$D$22=\"x\"),\"No Data\",IF(OR($F$5=\"Correction\",$F$5=\"Korrektur\"),($C$6/100)*(VALUE($E22)-$D22)*10*0.4975,\"\"))","v":9.9500000000000005E-2},{"$f":"IF(OR($F$5=\"Correction\",$F$5=\"Korrektur\"),\"\",($C$6/100)*(VALUE($E22)-0)*10*0.4975)","v":""},null,{"$f":"IF($I$2=\"Deutsch\",\"ml / Fe+ .... Eisen** \",\"ml / Fe+ .... Iron**\")","v":"ml / Fe+ .... Eisen** "},1,{"$f":"IF($I$2=\"Deutsch\",\"allmählich\",\"gradually\")","v":"allmählich"},null,{"$f":"IF($D$20>$E$20,\"0,15\",\"0,02\")","v":"0,02"}]
[null,{"$f":"IF($I$2=\"Deutsch\",\"Kommentar\",\"blabla..............comment  in here ........info ...... i.e. How the tank is running and please mention deviatiing used test kit.... \")","v":"Kommentar"},null,null,null,null,{"$f":"IF($I$2=\"Deutsch\",\"Beleuchtung Art und Zusammensetzung:\",\"Lighting type and composition:\")","v":"Beleuchtung Art und Zusammensetzung:"}]
[null,null,null,null,null,null,{"$f":"IF($I$2=\"Deutsch\",\"Wann die Röhren ersetzt oder Die Lampe angebracht :\",\"please mention when the fixture/lamps were placed or renewed:\")","v":"Wann die Röhren ersetzt oder Die Lampe angebracht :"}]
[]
[null,"Blau = Grundlagen , um loszulegen"]
[null,"Grün = Nährstoffe "]
[null,"Orange = Fine Tuning für SPS und LPS"]
[null,"lila = für Rosa und Rot Färbung der Tiere "]
[null,"rot = Probleme werden rot markiert mit Alarm "]

{"sheet":"Log","index":1,"n_rows":16,"n_cols":19,"rows_kept":16,"cut":false,"hidden":false,"merged":[[0,11,0,17]]}
[" ",null,"DATA LOG (Informationen aus dem DSR-Rechner kopiert)",null,null,null,null,null,null,null,null,{"$f":"+Calculator!F4","v":"Test Aquarium"},null,null,null,null,null,null,"Nie löschen Sie alle Daten über Zeile 5, oder die Grafik nicht mehr funktionieren! Warte nur, bis Sie Ihre eigenen ersten 5 datarows haben, als Sie die „Dummy“ Einsen löschen."]
["Datum","\nAktion","liter","zeit","PH","Sal","KH","Ca","Mg","SO4","K","Sr","B","I","Mn (ppb)","PO4","NO3","Fe","\nKurzer Kommentar zum Tank"]
[]
["2017-05-24","Korrektur",100,"00:00:00",7.9,33,7,335,1305,"x",380,1,1,0.03,0,0.02,1,0,"Kommentar"]
["2017-05-24","Korrektur",100,"00:00:00",8,33,7,335,1305,"x",385,1,1,0.03,0,0.2,1,0,"Kommentar"]
["2016-11-01","Correction",100,"00:00:00",8,33,7,335,1305,"x",385,1,1,0.03,0,0.02,1,0,"Stap3: dit is de meting waarop het nieuwe verbruik wordt bepaald"]
["2016-10-23","setpoint",100,"12:00:00",8,33,9,440,1350,"x",440,8,4,0.06,0,0.04,2.5,"x","stap2: Hier komen de gecorrigeerde waarden. Die zijn bedoeld als uitgangspunt  voor het volgende metingen"]
["2016-10-23","Correction",100,"12:00:00",8,33,7,335,1305,"x",385,1,1,0.03,0,0.02,1,0,"stap 1: dit is de meting voor de correctie"]
["2016-06-20",null,100,"13:04:00",7.99,33,7.2,480,"x","x","x","x","x","x","x","x","x","x"]
["2016-06-09","Correction",100,"11:00:00",8.08,34.200000000000003,5.6,480,1395,"x",340,"x","x","x","x",0,0,"x"]
["2015-06-14","Correction",100,"x","x","x","x","x","x","x","x","x","x","x","x",0,0,"x","blabla..............comment  in here ........info ...... i.e. How the tank is running and please mention deviatiing used test kit.... "]
["2015-01-15","Correction",100,"09:30:00",7.65,32,6,390,1100,"x",380,2,2,0.01,0,0.02,0.5,0.01,"blabla..............comment  in here ........info ...... i.e. How the tank is running and please mention deviatiing used test kit.... "]
["2014-04-01","Correction",100,"12:30:00",7,33,7,330,1100,null,370,6,3,0.06,null,0.06,2,0.01,"bla bla  .... ..hier Commentaar ...........info.............b.v. staat van de aquarium en dieren en vermelding van afwijkende test                              blabla..............comment  in here ........info ...... i.e. How the tank is running and please mention deviatiing used test kit.... "]
["2014-03-01","Correction",100,"12:30:00",7,33,7,330,1100,null,370,6,3,0.04,null,0.04,2,0.03,"bla bla  .... ..hier Commentaar ...........info.............b.v. staat van de aquarium en dieren en vermelding van afwijkende test                              blabla..............comment  in here ........info ...... i.e. How the tank is running and please mention deviatiing used test kit.... "]
["2014-02-02","Correction",100,"12:30:00",6,30,6,340,1150,null,360,2,1,0.06,null,0.02,0.5,0.05,"bla bla  .... ..hier Commentaar ...........info.............b.v. staat van de aquarium en dieren en vermelding van afwijkende test                              blabla..............comment  in here ........info ...... i.e. How the tank is running and please mention deviatiing used test kit.... "]
["2014-01-01","Correctie waarden",1,"12:30:00",6,33,7,430,1300,null,370,3,2,0.03,null,0.09,8,0.03,"...............comment.......... Comentaar ...........info...... Blablabla"]

{"sheet":"Fe dosing","index":2,"n_rows":15,"n_cols":8,"rows_kept":15,"cut":false,"hidden":false,"merged":[[3,6,3,7],[12,0,12,7],[13,0,13,7],[14,0,14,7],[2,4,2,7],[4,5,5,6],[4,7,5,7],[10,0,10,7],[11,0,11,7]]}
[]
["Fe + Tagesdosiertisch, als PO4-Entferner zu verwenden"]
["\nMaximale Einzeldosierung",1,{"$f":"+Calculator!$F$22","v":9.9500000000000005E-2},"ml","Daten aus dem Dosierfeld im DSR-Rechner"]
[null,null,null,null,null,"name:",{"$f":"+Calculator!F4","v":"Test Aquarium"}]
["Tag1",0.2,{"$f":"$C$3*B5","v":1.9900000000000001E-2},"ml",null,"Gesamtvolumen in Liter",null,{"$f":"Calculator!C6","v":100}]
["Tag2",0.4,{"$f":"$C$3*B6","v":3.9800000000000002E-2},"ml"]
["Tag3",0.6,{"$f":"$C$3*B7","v":5.9700000000000003E-2},"ml"]
["Tag4",0.8,{"$f":"$C$3*B8","v":7.9600000000000004E-2},"ml"]
["Tag5",1,{"$f":"$C$3*B9","v":9.9500000000000005E-2},"ml"]
[]
[{"$f":"IF(Calculator!$I$2=\"Deutsch\",\"** DSR Fe + wird als wirksamer PO4-Entferner verwendet. Eine Überdosierung kann für die Fische gefährlich sein. Dosierung allmählich bauen\",\"** DSR Fe+ is being used as a very efficient PO4 remover. Overdosing can be dangerous for the fishes. Gradualy build up the dosing\")","v":"** DSR Fe + wird als wirksamer PO4-Entferner verwendet. Eine Überdosierung kann für die Fische gefährlich sein. Dosierung allmählich bauen"}]
[{"$f":"IF(Calculator!$I$2=\"Deutsch\",\"Fe + (der PO4-Entferner) kann in einem Bereich von PO4> 0,04ppm verwendet werden.\",\"Fe+ (the PO4 remover) can be applied from PO4 range > 0,04ppm\")","v":"Fe + (der PO4-Entferner) kann in einem Bereich von PO4> 0,04ppm verwendet werden."}]
[{"$f":"IF(Calculator!$I$2=\"Deutsch\",\"FeTrace kann in einem Bereich von PO4 0,01ppm-0,08ppm verwendet werden.\",\"Fe Trace can be applied in de PO4 range 0,01ppm-0,08ppm\")","v":"FeTrace kann in einem Bereich von PO4 0,01ppm-0,08ppm verwendet werden."}]
[{"$f":"IF(Calculator!$I$2=\"Deutsch\",\"Es gibt einen Übergangsbereich, in dem Sie festlegen, welche Eisen besser für Sie wählen können.\",\"There is an overlapping range where you can choose which iron suits your needs best\")","v":"Es gibt einen Übergangsbereich, in dem Sie festlegen, welche Eisen besser für Sie wählen können."}]
[{"$f":"IF(Calculator!$I$2=\"Deutsch\",\"Wie viele ppm Eisen dosiert wird eine Wahl. Die Richtlinie ist, dass, wenn eine hohe PO4 Sie auf die maximale Dosis gehen Fe +\",\"How much ppm iron is being dosed is up to you. The guideline is, if you have high PO4 you should apply the maximum dosing Fe+\")","v":"Wie viele ppm Eisen dosiert wird eine Wahl. Die Richtlinie ist, dass, wenn eine hohe PO4 Sie auf die maximale Dosis gehen Fe +"}]

{"sheet":"CarbonVS3","index":3,"n_rows":21,"n_cols":10,"rows_kept":21,"cut":false,"hidden":false,"merged":[[1,1,1,4],[2,1,2,3],[20,1,20,4]]}
[]
[null,"CarbonVS Dosierungsplan  3.0 "]
[null,"Schnelle oder normale Dosierung?",null,null,"Normal",null,"Schnell"]
[null,"Volumen (L)",100,null,"v.170523",null,"Normal"]
[null,null,"Anfangsdatum","step","Dosierung (ml)",null,"percentage"]
[null,{"$f":"IF($E$3=\"Schnell\", \"Tag-1\",\"Tag 1-3\")","v":"Tag 1-3"},"2016-11-20","S1",{"$f":"($C$4/100)*0.5*G6","v":0.5},null,1,null,"D1",1]
[null,{"$f":"IF($E$3=\"Schnell\", \"Tag-2\",\"Tag 4-6\")","v":"Tag 4-6"},{"$f":"IF($E$3=\"Schnell\", C6+1,C6+3)","v":"2016-11-23"},"S2",0.6,null,{"$f":"G6+20%","v":1.2},null,"D2",{"$f":"J6+3","v":4}]
[null,{"$f":"IF($E$3=\"Schnell\", \"Tag-3\",\"Tag -7-9\")","v":"Tag -7-9"},"2016-11-26","S3",0.7,null,{"$f":"G7+20%","v":1.4},null,"D3",{"$f":"J7+3","v":7}]
[null,{"$f":"IF($E$3=\"Schnell\", \"Tag-4\",\"Tag 10-12\")","v":"Tag 10-12"},"2016-11-29","S4",0.84,null,{"$f":"G8*1.2","v":1.68},null,"D4",10]
[null,{"$f":"IF($E$3=\"Schnell\", \"Tag-5\",\"Tag 13-15\")","v":"Tag 13-15"},"2016-12-02","S5",1.008,null,2.016,null,"D5",13]
[null,{"$f":"IF($E$3=\"Schnell\", \"Tag-6\",\"Tag 16-18\")","v":"Tag 16-18"},"2016-12-05","S6",1.2096,null,2.4192,null,"D6",16]
[null,{"$f":"IF($E$3=\"Schnell\", \"Tag-7\",\"Tag 19-21\")","v":"Tag 19-21"},"2016-12-08","S7",1.4515199999999999,null,2.9030399999999998,null,"D7",19]
[null,{"$f":"IF($E$3=\"Schnell\", \"Tag-8\",\"Tag 22-24\")","v":"Tag 22-24"},"2016-12-11","S8",1.7418239999999998,null,3.4836479999999996,null,"D8",22]
[null,{"$f":"IF($E$3=\"Schnell\", \"Tag-9\",\"Tag 25-27\")","v":"Tag 25-27"},"2016-12-14","S9",2.0901887999999995,null,4.180377599999999,null,"D9",25]
[null,{"$f":"IF($E$3=\"Schnell\", \"Tag-10\",\"Tag 28-30\")","v":"Tag 28-30"},"2016-12-17","S10",2.5082265599999993,null,5.0164531199999987,null,"D10",28]
[null,{"$f":"IF($E$3=\"Schnell\", \"Tag-11\",\"Tag 31-33\")","v":"Tag 31-33"},"2016-12-20","S11",3.0098718719999993,null,6.0197437439999986,null,"D11",31]
[null,{"$f":"IF($E$3=\"Schnell\", \"Tag-12\",\"Tag 34-36\")","v":"Tag 34-36"},"2016-12-23","S12",3.611846246399999,null,7.2236924927999979,null,"D12",34]
[null,{"$f":"IF($E$3=\"Schnell\", \"Tag-13\",\"Tag 37-39\")","v":"Tag 37-39"},"2016-12-26","S13",4.3342154956799988,null,8.6684309913599975,null,"D13",37]
[null,{"$f":"IF($E$3=\"Schnell\", \"Tag-14\",\"Tag 40-42\")","v":"Tag 40-42"},"2016-12-29","S14",5.201058594815998,null,10.402117189631996,null,"D14",40]
[null,{"$f":"IF($E$3=\"Schnell\", \"Tag-15\",\"Tag 43=max\")","v":"Tag 43=max"},"2017-01-01","S15",6.2412703137791974,null,12.482540627558395,null,"D15",43]
[null,"Verwenden Sie nur Schnelldosierung, nachdem das Sandbett gereinigt und powerfilter angewendet wurde, sonst wählen Sie \"Normal\""]

{"sheet":"Volume Calc","index":4,"n_rows":31,"n_cols":8,"rows_kept":31,"cut":false,"hidden":false,"merged":[[7,0,13,1],[14,0,17,1],[16,5,17,7],[21,5,21,7],[23,5,23,7],[22,5,22,7],[23,0,24,0],[24,5,24,7],[26,5,26,7],[20,2,20,7],[16,2,17,2],[18,4,18,7],[25,5,25,7]]}
[null,null,null,null,"English","Nederlands"]
[]
["US Galons > Liters Converter","US Galons","Liters",null,null,{"$f":"IF($H$3=\"Nederlands\",\"Gekozen Taal\",\"Choosen Language\")","v":"Choosen Language"},null,"English"]
[null,315,{"$f":"B4*3.78541178","v":1192.4047106999999}]
[]
["***  Water volume  Calculator  ***",{"$f":"IF($H$3=\"Nederlands\",\"Total Berekende Liters\",\"Total Calculated Liters\")","v":"Total Calculated Liters"},"Result (dm3) = (L)",{"$f":"IF($H$3=\"Nederlands\",\"Lengte (cm)\",\"Length (cm)\")","v":"Length (cm)"},{"$f":"IF($H$3=\"Nederlands\",\"Breedte (cm)\",\"Width   (cm)\")","v":"Width   (cm)"},{"$f":"IF($H$3=\"Nederlands\",\" Water Hoogte (cm)\",\"Water Heigth (cm)\")","v":"Water Heigth (cm)"},null,"vers.160314"]
[{"$f":"IF($H$3=\"Nederlands\",\"Totaal berekend  water volume >>>\",\"Total Calculated water Volume >>>\")","v":"Total Calculated water Volume >>>"},{"$f":"SUM(C7:C19)","v":1747.7940000000001},{"$f":"(D7*E7*F7)/1000","v":1180},250,80,59,null,{"$f":"IF($H$3=\"Nederlands\",\"Showbak\",\"Show Tank\")","v":"Show Tank"}]
["....................................................................",null,50.88,75,64,10.6,null,"Sump"]
[null,null,207.48,65,76,42,null,"Refugium"]
[null,null,127.6,110,40,29,null,"Qt1"]
[null,null,51.24,30,28,61,null,"Qt2"]
[null,null,51.24,30,28,61,null,"Qt3"]
[null,null,76.05,78,39,25,null,"Qt4"]
[null,null,40.5,50,30,27,null,"Qt5"]
[{"$f":"IF($H$3=\"Nederlands\",\"De water volume calculator is een hulpmiddel voor het berekenen van de totale water volume. Deze waarde worden NIET overgenomen naar de DSR Calculator ! \",\"The water volume calculator is a tool to calculate the total water volume. This value is NOT transfered to the DSR Calculator!\")","v":"The water volume calculator is a tool to calculate the total water volume. This value is NOT transfered to the DSR Calculator!"},null,{"$f":"-(((D15*E15*F7)/1000)-((D15*E15*F15)/1000))","v":-29.695999999999998},32,32,30,null,{"$f":"IF($H$3=\"Nederlands\",\"overloop kamer (buitenmaat)\",\"Skimmer compartment\")","v":"Skimmer compartment"}]
[null,null,{"$f":"-(D16*E16*F16)/1000","v":0},0,0,{"$f":"+F7","v":59},null,{"$f":"IF($H$3=\"Nederlands\",\"Droog kamer (buitenmaat)\",\"Cable compartment\")","v":"Cable compartment"}]
[null,null,{"$f":"-(D18*E18)","v":-7.5},{"$f":"IF($H$3=\"Nederlands\",\"Gewicht (Kg)\",\"Weight (Kg)\")","v":"Weight (Kg)"},"factor",{"$f":"IF($H$3=\"Nederlands\",\"Opbouwen (opgeven gewicht en omreken factor)\",\"Rock formations ( provide weight and factor )\")","v":"Rock formations ( provide weight and factor )"}]
[null,null,null,10,0.75]
[null,null,0,"<<<<<",{"$f":"IF($H$3=\"Nederlands\",\"zelf op te geven volume aftrek\",\"Provide  own volume to substract from total \")","v":"Provide  own volume to substract from total "}]
[]
[null,null,"kilo > liter omreken factor voor verschillende materialen"]
[null,null,{"$f":"-(D22*E22)","v":-8.3651162790697668},10,{"$f":"35.97/43","v":0.83651162790697675},"factor voor koraal zand 0,5-1mm (droog gewicht)"]
[null,null,-5.7037037037037042,10,{"$f":"15.4/27","v":0.57037037037037042},"factor voor koraal zand 0,5-1mm (nat gewicht)"]
[{"$f":"IF($H$3=\"Nederlands\",\"Alleen de GELE velden zijn te bewerken. Het werkblad is beveiligd om overschrijven van formules te  voorkomen\",\"Only the YELLOW fields are editable. The calculation sheet is protected to prevent overwriting of formula's\")","v":"Only the YELLOW fields are editable. The calculation sheet is protected to prevent overwriting of formula's"},null,-7.1578947368421053,10,{"$f":"27.2/38","v":0.71578947368421053},"factor voor dymico filtermassa (dolemiet)"]
[null,null,-4.7659574468085104,10,{"$f":"11.2/23.5","v":0.47659574468085103},"factor voor poreus  levend steen  (luchtig)"]
[null,null,-4.541666666666667,10,{"$f":"10.9/24","v":0.45416666666666666},"factor voor massief  levend steen  (zwaar)"]
[null,null,-3.7844036697247709,10,{"$f":"8.25/21.8","v":0.37844036697247707},"factor voor  massief cement/beton"]
[null,null,{"$f":"SUM(C22:C27)","v":-34.318742502815525},"totaal"]
[]
[]
["Freier Bearbeitungsbereich  >>>>>"]

{"sheet":"PPM>ml","index":5,"n_rows":25,"n_cols":11,"rows_kept":25,"cut":false,"hidden":false,"merged":[[24,1,24,3],[4,1,4,6],[5,1,5,7],[23,1,23,3]]}
[null,"***  Dutch Synthetic Reefing  ***  ( de DSR Methode )  ***","Result (Res) (dm3) = (L)","Lengte (cm)","Breedte (cm)"," W-Hoogte (cm)","Vers.130721"]
[null,"DSR Mineralen Calculator by GlennF",{"$f":"(D2*E2*F2)/1000","v":1180},250,80,59,"Bak (binnemaat)"]
[null,null,{"$f":"(D3*E3*F3)/1000","v":67.2},80,70,12,"Sump (binnenmaat)"]
[null,null,{"$f":"(D4*E4*F4)/1000","v":0},0,70,45,"Refugium"]
[]
[null,"PPM > Grams/Milliliters Convertor v.170603"]
[null,"Dosing Liquid ?",null,"Y"]
[null,"Tank volume (Liters)",null,100]
[null,"DSR Products","Start"," ppm","dosing","100% aanmaak","Units","Opm./Check"]
[null,"Salinity/ NaCl: (ppt)",0,1,{"$f":"($D$8/100)*(D10-C10)*100","v":100},{"$f":"$E10*0.87","v":87},"gram","1ppt = 100gr/100L",null,null,"Y"]
[null,"PH+ (liquid only)",0,1,{"$f":"($D$8/100)*(D11-C11)*3*11.1/2","v":16.649999999999999},{"$f":"+E11","v":16.649999999999999},"ml"]
[null,"KH+",0,1,{"$f":"IF($D$7=\"Y\",($D$8/100)*(D12-C12)*3*11.1,($D$8/100)*(D12-C12)*3)","v":33.299999999999997},{"$f":"+E12","v":33.299999999999997},{"$f":"IF($D$7=\"Y\", \"ml\",\"gram\")","v":"ml"},"1KH = 3gr/100L",null,null,"N"]
[null,"Ca+ ",0,10,{"$f":"IF($D$7=\"Y\", ($D$8/100)*(D13-C13)*0.3668*1.429,($D$8/100)*(D13-C13)*0.3668)","v":5.2415720000000006},{"$f":"+E13","v":5.2415720000000006},{"$f":"IF($D$7=\"Y\", \"ml\",\"gram\")","v":"ml"},"1mg/l = 0,3668gr/100L"]
[null,"Mg+",0,10,{"$f":"IF($D$7=\"Y\", ($D$8/100)*(D14-C14)*0.836*1.33,($D$8/100)*(D14-C14)*0.836)","v":11.1188},{"$f":"($E$14/7)*6","v":9.5304000000000002},{"$f":"IF($D$7=\"Y\", \"ml\",\"gram\")","v":"ml"},"1mg/l = 0,836gr/100L"]
[null,"Mg (by MgSO4+)\n",null,10,{"$f":"IF($D$7=\"Y\", ($D$8/100)*(D15-C15)*0.836*1.33,($D$8/100)*(D15-C15)*1.01389)","v":11.1188},{"$f":"($E$14/7)*6","v":9.5304000000000002},{"$f":"IF($D$7=\"Y\", \"ml\",\"gram\")","v":"ml"}]
[null,"K+",0,10,{"$f":"IF($D$7=\"Y\",($D$8/100)*(D16-C16)*0.667,($D$8/100)*(D16-C16)*0.190476)","v":6.67},{"$f":"$E16*0.81","v":5.4027000000000003},{"$f":"IF($D$7=\"Y\", \"ml\",\"gram\")","v":"ml"},"1mg/l  =0,190476gr/100L"]
[null,"Sr+",0,1,{"$f":"($D$8/100)*(D17-C17)*3","v":3},{"$f":"+E17","v":3},"ml","1mg/l = 3,04ml/100L"]
[null,"B+ ",0,1,{"$f":"($D$8/100)*(D18-C18)*12.68","v":12.68},{"$f":"+E18","v":12.68},"ml","1mg/l = 12,68ml/100L"]
[null,"I2+",0,3.0000000000000001E-3,{"$f":"($D$8/100)*(D19-C19)*100*0.26","v":7.8E-2},{"$f":"+E19","v":7.8E-2},"ml","0,01mg/l = 0,26ml/100L"]
[null,"Mn+ (ppb)",0,0.4,{"$f":"($D$8/100)*(D20-C20)*10*0.1","v":0.4},null,"ml"]
[null,"PO4+",0,0.02,{"$f":"($D$8/100)*(D21-C21)*100*0.1","v":0.2},{"$f":"+E21","v":0.2},"ml","0,01mg/l = 0,1ml/100L"]
[null,"2xNO3+ new!!!",0,1,{"$f":"($D$8/100)*(D22-C22)*(1.44/2)","v":0.72},{"$f":"+E22","v":0.72},"ml","1mg/l = 1,44ml/100L"]
[null,"Fe Trace / Fe+",0,0.15,{"$f":"($D$8/100)*(D23-C23)*10*0.4975","v":0.74624999999999997},{"$f":"+E23","v":0.74624999999999997},"ml","0,1mg/l = 0,4975ml/100L"]
[null,"CarbonVS (average daily dose)",null,null,{"$f":"(D8/100)*0.5","v":0.5},{"$f":"+E24","v":0.5},"ml"]
[null,"Amino/C (weekly dose)",null,null,{"$f":"(D8/100)*1","v":1},{"$f":"+E25","v":1},"ml"]

{"sheet":"S-calc","index":6,"n_rows":13,"n_cols":5,"rows_kept":13,"cut":false,"hidden":false,"merged":[[0,0,0,3],[12,0,12,4],[1,4,10,4],[11,0,11,2],[3,1,3,2],[4,1,4,2],[2,1,2,2],[1,1,1,3],[5,0,5,2]]}
["Sulfaat calculator v.161102"]
[null,"auto calculator",null,null,"auto calculator: hiermee wordt berekend wat, je van MgCl2 en MgSO4 nodig heb om de target Mg en S waarden te bereiken "]
[null,"Volume (L)",null,650]
[null,"target Mg",null,1350]
[null,"target S",null,{"$f":"904-343","v":561}]
["manual adjustment"]
["stof","grams","Mg Ions","grams"]
["Mg+",0,{"$f":"($B$8/$D$3)*1000*(24.31/203.306)","v":0},{"$f":"(($D$3/1000)*($D$4-($B$9/$D$3)*1000*(24.31/246.482))*(203.306/24.31))","v":5026.5842064288026}]
["MgSO4",2803,{"$f":"($B$9/$D$3)*1000*(24.31/246.482)","v":425.31381601901967},{"$f":"($D$3/1000)*($D$5)*(246.482/32.06)","v":2803.4828852152214}]
["MgTotal",null,{"$f":"SUM(C8:C9)","v":425.31381601901967}]
["S total",null,{"$f":"($B$9/$D$3)*1000*(32.06/246.482)","v":560.90337069394366}]
["manual adjustment: na invullen van  het aantal liters kan je experimenteren en zien wat het effect is van diverse mix verhoudingen op het Mg en S gehalte."]
["Het bepalen van S toevoegen d.m.v. MgSO4 kan, door  het tekort (bij target) en het aantal liters (watervolume) in te vullen. Daarmee wordt aangeven hoeveel MgSO4 aangevuld dient te worden om S op peil te brengen. Het MgSO4 weegt men af en  legt dit apart. Dit dient geleidelijk gebruikt te worden i.p.v. Mg+ (MgCl2) om je Mg op peil te houden, totdat het aangegeven hoeveelheid MgSO4 verbruikt is. Omdat de DSR calculator Mg+ berekend, dient   het aangeven gewicht met 1,21  vermenigvuldigen te worden bij het toepassen van MgSO4."]